éteignoir
created: 2012-05-16T00:00:00+02:00
modified: 2014-12-05T14:24:23+01:00
status: 1
type: Concept
broad match: http://data.bnf.fr/ark:/12148/cb11966814f
broader: T69-4423
definition: Petit cône, muni ou non d'un élément de prise, avec lequel on coiffe une bougie ou une mèche pour l'éteindre.
in scheme: T69
preferred label: extinguishers @en-us