pied de lampe
created: 2012-05-16T00:00:00+02:00
modified: 2014-12-05T14:35:25+01:00
status: 1
type: Concept
broad match: cb11978573t
broad match: Lampe
broader: T69-4423
definition: Support, souvent décoratif, sur lequel on pose une lampe.
in scheme: T69
preferred label: lamp bases @en-us