tire-mèche
created: 2012-05-16T00:00:00+02:00
modified: 2014-12-05T14:39:08+01:00
status: 1
type: Concept
broad match: cb16538831w
broad match: Mèche à feu
broad match: http://vocab.getty.edu/aat/300037630
broader: T69-4423
definition: Petite pince ou aiguille en métal servant à tirer la mèche de la lampe à huile et à nettoyer le bec. Le tire-mèche est suspendu à la lampe par une chaîne.
in scheme: T69