versoir
created: 2012-05-16T00:00:00+02:00
modified: 2014-12-05T14:39:52+01:00
status: 1
type: Concept
alternative label: versoir à essence
alternative label: versoir à huile
alternative label: versoir à pétrole
broad match: cb11978573t
broader: T69-4423
definition: Récipient généralement couvert et à fond plat, contenant le combustible liquide nécessaire au remplissage des lampes. Il est généralement muni d'un long goulot et d'une anse latérale.
in scheme: T69