objet d'âtre
created: 2012-05-16T00:00:00+02:00
modified: 2014-10-16T13:58:37+02:00
status: 1
type: Concept
alternative label: berceau à bûches
alternative label: casserole à braises
alternative label: chevrette d'âtre
alternative label: cloche à braises
alternative label: couvre-feu
alternative label: crible-cendres
alternative label: porte-braises
alternative label: seau à charbon
alternative label: étouffoir à braises
broader: T69-3577
definition: Instrument ou dispositif lié à la cheminée et à l’entretien du feu.
in scheme: T69
narrower: T69-4455
narrower: T69-4459
narrower: T69-4466
narrower: T69-4470
narrower: T69-4472
narrower: T69-4474
narrower: T69-4475
narrower: T69-4478
narrower: T69-4479
narrower: T69-4482
narrower: T69-4484
narrower: T69-4486
preferred label: fire-making and controlling equipment @en-us