chenet
terme associe: T69-4491
created: 2012-05-16T00:00:00+02:00
modified: 2014-12-05T14:42:17+01:00
status: 1
type: Concept
alternative label: chenet en portique
alternative label: chenet porte-broche
alternative label: chenet porte-manche
alternative label: chenet porte-éclat de bois
alternative label: chenet porte-écuelle
alternative label: chenet à tiroir
alternative label: landier
alternative label: marmouset
broader: T69-4454
definition: Support en métal, allant par paires, placé perpendiculairement au fond de l'âtre et sur lequel on dispose les bûches. Le chenet est constitué d’un élément horizontal (le chevalet) et d’une barre verticale (le montant) souvent ornée.
in scheme: T69
preferred label: andirons @en-us
related: T69-4491