fourche d'âtre
created: 2012-05-16T00:00:00+02:00
modified: 2014-12-05T14:44:04+01:00
status: 1
type: Concept
alternative label: fourche à fagot
alternative label: fourche à feu
alternative label: fourche à foyer
broader: T69-4454
definition: Petite fourche en métal à deux ou trois dents, munie d'un manche, servant à manier les bûches ou les fagots et à remuer les cendres.
in scheme: T69
preferred label: fire rakes @en-us