pelle d'âtre
created: 2012-05-16T00:00:00+02:00
modified: 2014-12-05T14:44:45+01:00
status: 1
type: Concept
alternative label: palette à braises
alternative label: palette à cendres
alternative label: pelle de foyer
alternative label: pelle à feu
broad match: Fire iron
broader: T69-4454
definition: Pelle en métal, à long manche, à spatule généralement pleine, servant à ramasser les braises et à les dégager de la cendre. Elle est assortie aux pincettes et au tisonnier.
in scheme: T69
preferred label: fire shovels @en-us