pincettes
created: 2012-05-16T00:00:00+02:00
modified: 2014-12-05T14:45:40+01:00
status: 1
type: Concept
alternative label: pinces à braises
alternative label: pinces à feu
alternative label: tenailles à feu
broad match: Fire iron
broader: T69-4454
definition: Pince à ressort en métal, parfois à charnière, permettant de saisir les bûches et les braises. Elles sont assorties à la pelle d'âtre et au tisonnier.
in scheme: T69
preferred label: fire tongs @en-us