repousse-braises
created: 2012-05-16T00:00:00+02:00
modified: 2014-10-16T14:11:33+02:00
status: 1
type: Concept
alternative label: garde-cendres
alternative label: repousse-cendres
alternative label: resserre-braises
broad match: cb11931172v
broader: T69-4454
definition: Cadre métallique posé devant les chenets pour empêcher les cendres de s'éparpiller.
in scheme: T69
preferred label: fenders (fire-controlling equipment) @en-us