soufflet à bouche
created: 2012-05-16T00:00:00+02:00
modified: 2014-10-16T14:12:34+02:00
status: 1
type: Concept
alternative label: bouffadou
broad match: cb11931172v
broader: T69-4454
definition: Long tube creux dans lequel on souffle de l'air pour activer le feu.
in scheme: T69