soufflet à main
created: 2012-05-16T00:00:00+02:00
modified: 2014-12-05T14:51:30+01:00
status: 1
type: Concept
alternative label: éventoir
broad match: cb11931172v
broader: T69-4454
definition: Instrument servant à souffler de l'air pour activer le feu. Il est constitué d'une cavité souple, généralement en cuir, fixée entre deux tablettes qui se déplient en faisant entrer l'air et se replient en le chassant, sous pression, chassé par un embout étroit en métal.
in scheme: T69
preferred label: bellows @en-us