tisonnier
created: 2012-05-16T00:00:00+02:00
modified: 2014-12-05T14:53:18+01:00
status: 1
type: Concept
alternative label: crochet de foyer
alternative label: hache à braises
alternative label: pique-feu
alternative label: ringard
broad match: cb11931172v
broader: T69-4454
definition: Tige, à l’extrémité adaptée, pour gratter, fendre et remuer les braises, pour manier les broches ou soulever les bûches.
in scheme: T69
preferred label: pokers @en-us