objet d'âtre pour la cuisson
created: 2012-05-16T00:00:00+02:00
modified: 2014-10-16T14:15:30+02:00
status: 1
type: Concept
alternative label: anse servante
alternative label: chaîne servante
alternative label: crochet à couvercle
alternative label: main de fer
alternative label: pince à débrocher
broader: T69-3577
definition: Instrument ou dispositif utilisé pour la cuisson des aliments dans la cheminée.
in scheme: T69
narrower: T69-4491
narrower: T69-4497
narrower: T69-4503
narrower: T69-4507
narrower: T69-4508
narrower: T69-4513
narrower: T69-4515
narrower: T69-4517
narrower: T69-4520
narrower: T69-4522
narrower: T69-4524