lanterne des morts
created: 2012-05-16T00:00:00+02:00
modified: 2015-02-24T12:10:54+01:00
status: 1
type: Concept
broader: T69-426
definition: Édicule servant de fanal dans les cimetières.
in scheme: T69
preferred label: lanterns of the dead @en-us
scope note: Voir aussi le Thesaurus de la désignation des œuvres architecturales et des espaces aménagés.