crémaillère
terme associe: T69-3261
created: 2012-05-16T00:00:00+02:00
modified: 2014-12-05T14:54:50+01:00
status: 1
type: Concept
alternative label: crémaillère à anneaux
alternative label: crémaillère à crans
alternative label: crémaillère à crans à cliquet
alternative label: crémaillère à crans à manivelle
alternative label: crémaillère à crocs
alternative label: crémaillère à ergots
alternative label: crémaillère à échelons
broad match: cb11931172v
broad match: http://vocab.getty.edu/aat/300200422
broader: T69-4488
definition: Dispositif réglable en hauteur (à crémaillère) fixé dans la cheminée, auquel on suspend un récipient à anse pour le maintenir au-dessus du feu de cuisson.
in scheme: T69
preferred label: trammels @en-us
related: T69-3261