canapé
created: 2012-05-16T00:00:00+02:00
modified: 2014-12-05T12:13:54+01:00
status: 1
type: Concept
alternative label: boudeuse
alternative label: canapé en borne
alternative label: confident
alternative label: indiscret
alternative label: sofa
broader: T69-2666
definition: Siège à plusieurs places, garni, comportant un dossier et des accotoirs. Les places peuvent être marquées par le dossier ou par des accotoirs intermédiaires.
in scheme: T69
preferred label: sofas @en-us