mont calvaire
created: 2012-05-16T00:00:00+02:00
modified: 2015-02-24T12:13:22+01:00
status: 1
type: Concept
alternative label: chemin de croix extérieur
broader: T69-426
definition: Chemin de croix extérieur dont les stations sont marquées par de petits oratoires échelonnés sur un parcours qui conduit à une croix monumentale ou à une église.
in scheme: T69
scope note: Ne pas confondre avec calvaire monumental. Voir aussi le Thesaurus de la désignation des œuvres architecturales et des espaces aménagés.