porte-broches
created: 2012-05-16T00:00:00+02:00
modified: 2014-12-05T14:57:14+01:00
status: 1
type: Concept
broad match: cb11931172v
broad match: Broche
broad match: http://vocab.getty.edu/aat/300201151
broader: T69-4488
definition: Support, généralement par paires, servant à maintenir l'extrémité des broches à rôtir.
in scheme: T69
preferred label: spits racks @en-us