porte-poêle
terme associe: T69-3048
created: 2012-05-16T00:00:00+02:00
modified: 2014-10-16T14:22:32+02:00
status: 1
type: Concept
alternative label: porte-manche
alternative label: porte-écuelle
broad match: Poêle (cuisine)
broader: T69-4488
definition: Support, souvent trépied, sur lequel on pose les poêles chaudes en dehors de l’âtre.
in scheme: T69
related: T69-3048