réflecteur de chaleur
created: 2012-05-16T00:00:00+02:00
modified: 2014-09-19T11:03:01+02:00
status: 1
type: Concept
alternative label: coquille-réflecteur
broad match: cb11931172v
broad match: http://vocab.getty.edu/aat/300200422
broader: T69-4488
definition: Large coquille, posée verticalement devant le feu, servant à réfléchir la chaleur dans la cuisson à la broche.
in scheme: T69