tourne-broche
created: 2012-05-16T00:00:00+02:00
modified: 2014-12-05T15:01:33+01:00
status: 1
type: Concept
broad match: cb13337214n
broader: T69-4488
definition: Mécanisme servant à faire tourner la broche de cuisson devant le feu.
in scheme: T69
preferred label: rotisseries @en-us