bouillotte
created: 2012-05-16T00:00:00+02:00
modified: 2014-12-10T17:03:07+01:00
status: 1
type: Concept
alternative label: bouillotte de lit
alternative label: bouillotte à mains
broad match: cb11934810z
broader: T69-4526
definition: Récipient, en forme de bouteille, gourde, boule, livre, etc. que l'on remplit d'eau chaude pour se réchauffer les mains ou les pieds, ou chauffer l'intérieur d'un lit.
in scheme: T69
preferred label: hot-water bottles @en-us