chauffe-bain
created: 2012-05-16T00:00:00+02:00
modified: 2014-10-17T15:31:17+02:00
status: 1
type: Concept
broad match: http://vocab.getty.edu/aat/300163292
broader: T69-4526
definition: Récipient rempli de braises, que l'on plonge dans l'eau d'un bain pour la chauffer. Il peut être muni de cheminées destinées à diffuser la chaleur.
in scheme: T69
preferred label: water-heaters @en-us