bassinoire
created: 2012-05-16T00:00:00+02:00
modified: 2014-12-10T17:08:04+01:00
status: 1
type: Concept
alternative label: bassinoire-moine
broad match: cb11934810z
broader: T69-4533
definition: Chaufferette circulaire à fond plat, munie d'un long manche latéral, que l'on glisse dans le lit pour le réchauffer.
in scheme: T69
preferred label: bed warmers @en-us