mont des Oliviers
created: 2012-05-16T00:00:00+02:00
modified: 2015-02-24T12:17:12+01:00
status: 1
type: Concept
broad match: http://vocab.getty.edu/aat/300006958
broader: T69-426
definition: Groupe sculpté, et par extension l’édicule qui peut l’abriter, placé à l'extérieur ou à l'intérieur d'un édifice religieux et représentant l'agonie du Christ au Mont des Oliviers.
in scheme: T69