pierre des morts
created: 2012-05-16T00:00:00+02:00
modified: 2015-02-24T12:20:53+01:00
status: 1
type: Concept
alternative label: banc des morts
broader: T69-426
definition: Grande pierre rectangulaire, parfois appelée banc des morts, placée devant l'entrée d'une église, sur laquelle on posait le cercueil avant la mise en terre. Elle peut comporter un soubassement avec des degrés et être accompagnée d’une croix monumentale.
in scheme: T69
scope note: Voir aussi le Thesaurus de la désignation des œuvres architecturales et des espaces aménagés.