presse-papiers
created: 2012-05-16T00:00:00+02:00
modified: 2014-12-10T15:22:18+01:00
status: 1
type: Concept
broader: T69-4600
definition: Petite masse présentant une face plate généralement surmontée d'un motif sculpté, que l'on pose sur des papiers pour les maintenir en place.
in scheme: T69
preferred label: paperweights @en-us