sous-main
created: 2012-05-16T00:00:00+02:00
modified: 2014-12-10T15:23:19+01:00
status: 1
type: Concept
broader: T69-4600
definition: Accessoire constitué par un buvard inséré dans un cadre généralement en cuir, sur lequel on pose le papier pour écrire. Le sous-main peut être constitué de deux éléments et former portefeuille.
in scheme: T69
preferred label: desk pads @en-us