objet pour fumer et priser
created: 2012-05-16T00:00:00+02:00
modified: 2014-10-17T12:37:17+02:00
status: 1
type: Concept
alternative label: chauffe-pipes
alternative label: chaufferette à pipes
alternative label: coupe-chique
alternative label: coupe-cigare
alternative label: couteau de fumeur
alternative label: cure-pipe
alternative label: hachoir à tabac
alternative label: mortier à tabac à priser
alternative label: nécessaire à amadou
alternative label: pelle de fumeur
alternative label: pince à amadou
alternative label: pincette de fumeur
alternative label: pincette à braises
alternative label: porte-boîte d'allumettes
alternative label: porte-pipes
alternative label: porte-pipes pyrogène
alternative label: râtelier à pipes
alternative label: réchaud à pipes
alternative label: étui à boîte d'allumettes
alternative label: étui à briquet
broader: T69-3577
definition: Objet lié à la préparation, à la consommation ou à la conservation du tabac.
in scheme: T69
narrower: T69-4653
narrower: T69-4655
narrower: T69-4657
narrower: T69-4669
narrower: T69-4673
narrower: T69-4675
narrower: T69-4691
narrower: T69-4693
narrower: T69-4695
narrower: T69-4697
narrower: T69-4701
narrower: T69-4703
narrower: T69-4711
preferred label: equipment for personal use : smoking and tobacco use @en-us