briquet
created: 2012-05-16T00:00:00+02:00
modified: 2014-12-10T15:26:24+01:00
status: 1
type: Concept
alternative label: allume-cigare
alternative label: boîte à amadou
alternative label: boîte à briquet à amadou
alternative label: boîte à briquet à silex
alternative label: briquet au ferrocérium et à essence
alternative label: briquet phosphorique
alternative label: briquet solaire
alternative label: briquet à air pneumatique
alternative label: briquet à amorces
alternative label: briquet à catalyse
alternative label: briquet à essence à molette
alternative label: briquet à friction à molette
alternative label: briquet à hydrogène
alternative label: briquet à oxygène
alternative label: briquet à percussion
alternative label: briquet à silex
alternative label: briquet à silex combiné
alternative label: briquet électrique à essence
alternative label: luminus
broader: T69-4652
definition: Instrument servant à produire une étincelle soit par percussion manuelle ou automatique soit par réaction chimique, ou encore par combinaison de ces fonctionnements, pour enflammer un matériau combustible. Le briquet peut être posé, d'applique ou de poche.
in scheme: T69
preferred label: lighters (fire-making equipment) @en-us