étui à pipe
created: 2012-05-16T00:00:00+02:00
modified: 2014-12-10T15:32:18+01:00
status: 1
type: Concept
broad match: cb11933139h
broader: T69-4652
definition: Étui en matériau rigide divisé en deux moitiés assemblées à charnière, de la forme de la pipe qu'il contient.
in scheme: T69
preferred label: pipe holders @en-us