râpe à tabac
created: 2012-05-16T00:00:00+02:00
modified: 2014-12-10T15:42:28+01:00
status: 1
type: Concept
alternative label: grivoise
alternative label: râpe coupe-chique
alternative label: râpe de poche
alternative label: râpe de table
alternative label: râpe-tabatière
broader: T69-4652
definition: Râpe servant à réduire en poudre les feuilles de tabac serrées en carottes, afin de le priser. Elle est maintenue dans une monture de forme adaptée, fermée généralement sur le dessus par un couvercle plat, dans le même matériau. Elle est parfois à double face et comporte fréquemment à une extrémité un petit réceptacle pour recueillir la poudre.
in scheme: T69
preferred label: tobacco graters @en-us