objet ou matériel pour les ouvrages textiles
terme associe: T69-2772
terme associe: T69-5437
terme associe: T69-9617
created: 2012-05-16T00:00:00+02:00
modified: 2014-10-17T11:52:42+02:00
status: 1
type: Concept
alternative label: affiquet
alternative label: aiguille
alternative label: aiguille à piqueter
alternative label: aiguille à tricoter
alternative label: bobine
alternative label: boîte à ficelle
alternative label: boîte à fil
alternative label: boîte à laine
alternative label: boîte à pelote
alternative label: broche à tricoter
alternative label: mouille-doigts
alternative label: passe-lacet
alternative label: planchette de dentelle
alternative label: plioir à dentelle
alternative label: porte-bobine
alternative label: presse à paille
alternative label: protège-pointe
alternative label: servante pour renvidoir
alternative label: taille-craie
alternative label: œuf à broder
alternative label: œuf à coudre
alternative label: œuf à repriser
broader: T69-3577
definition: Objet lié à la préparation ou à la fabrication domestique des textiles, aux travaux de couture ou aux ouvrages de dames.
in scheme: T69
narrower: T69-3425
narrower: T69-3431
narrower: T69-3439
narrower: T69-3441
narrower: T69-3449
narrower: T69-4724
narrower: T69-4728
narrower: T69-4732
narrower: T69-4733
narrower: T69-4735
narrower: T69-4739
narrower: T69-4741
narrower: T69-4745
narrower: T69-7889
narrower: T69-7896
preferred label: textile working equipment @en-us
related: T69-2772
related: T69-5437
related: T69-9617