aiguillier
created: 2012-05-16T00:00:00+02:00
modified: 2014-12-10T14:17:48+01:00
status: 1
type: Concept
alternative label: boîte à aiguilles
alternative label: pelote à épingles
alternative label: porte-aiguilles
alternative label: épinglier
alternative label: étui à aiguilles
broader: T69-4715
definition: Petit carnet contenant des feuillets de tissu reliés, sur lesquels sont piquées les aiguilles à coudre et les épingles.
in scheme: T69
preferred label: needle cases @en-us