boîte à ouvrage
terme associe: T69-2772
created: 2012-05-16T00:00:00+02:00
modified: 2014-12-10T14:19:32+01:00
status: 1
type: Concept
alternative label: boîte à couture
alternative label: corbeille à ouvrage
alternative label: panier à ouvrage
alternative label: trousse à couture
broader: T69-4715
definition: Boîte, corbeille, panier ou trousse contenant les objets nécessaires pour la couture, la broderie ou le tricot. Elle est divisée intérieurement en compartiments et en casiers indépendants adaptés, disposés sur plusieurs niveaux mobiles.
in scheme: T69
preferred label: sewing boxes @en-us
related: T69-2772