dé à coudre
created: 2012-05-16T00:00:00+02:00
modified: 2014-12-10T14:23:15+01:00
status: 1
type: Concept
broader: T69-4715
definition: Élément creux, piqueté à l'extérieur, que l'on enfile au bout du doigt pour pousser l'aiguille sans se piquer.
in scheme: T69
preferred label: thimbles @en-us