métier à broder domestique
terme associe: T69-5781
created: 2012-05-16T00:00:00+02:00
modified: 2014-12-10T14:32:40+01:00
status: 1
type: Concept
alternative label: métier à broder les gants
alternative label: métier à broder sur pieds
alternative label: métier à broder à poser
alternative label: métier à châssis
alternative label: métier à tambour
alternative label: poinçon de brodeuse
alternative label: poinçon à broder
alternative label: tambour à broder
broad match: http://data.bnf.fr/ark:/12148/cb119400073
broad match: http://vocab.getty.edu/aat/300163224
broader: T69-4715
definition: Support généralement en bois pour tendre le tissu à broder. Le métier (à tambour ou châssis) est posé sur des pieds ; le tambour à broder est tenu à la main.
in scheme: T69
preferred label: embroidery frames @en-us
related: T69-5781