horloge publique
terme associe: T69-4956
terme associe: T69-5323
terme associe: T69-5329
created: 2012-05-16T00:00:00+02:00
modified: 2015-02-24T11:21:12+01:00
status: 1
type: Concept
alternative label: horloge d'édifice
broad match: Horloge
broader: T69-464
definition: Édicule, panneau ou cadran, de plus ou moins grandes dimensions, muni d’un dispositif indiquant l'heure et placé dans un lieu public.
in scheme: T69
related: T69-4956
related: T69-5323
related: T69-5329
scope note: Voir aussi le Thesaurus de la désignation des œuvres architecturales et des espaces aménagés.