garniture de lit
terme associe: T69-2689
terme associe: T69-2703
created: 2012-05-16T00:00:00+02:00
modified: 2014-12-12T12:25:18+01:00
status: 1
type: Concept
alternative label: ciel de lit
alternative label: courtine de lit
alternative label: couvre-lit
alternative label: dessus de lit
broader: T69-4768
definition: Ensemble des pièces qui peuvent s'ajouter à la literie pour rendre la couche plus confortable en la protégeant du froid. La garniture comprend généralement un ciel de lit, un dossier, des pentes de lit, des courtines de lit, etc.
in scheme: T69
narrower: T69-4774
preferred label: coverings and hangings for sleeping and reclining furniture @en-us
related: T69-2689
related: T69-2703