coussin
created: 2012-05-16T00:00:00+02:00
modified: 2014-12-12T12:22:02+01:00
status: 1
type: Concept
alternative label: housse de coussin
broader: T69-4768
definition: Accessoire mobilier composé d'une enveloppe de tissu ou de cuir, emplie de laine, de plume, de crin, etc., utilisé comme élément de confort ou de décor.
in scheme: T69
preferred label: cushions @en-us