garniture architecturale
terme associe: T69-4887
terme associe: T69-6707
created: 2012-05-16T00:00:00+02:00
modified: 2014-12-12T11:04:21+01:00
status: 1
type: Concept
alternative label: cuir peint
alternative label: papier peint
alternative label: toile peinte
broader: T69-6546
definition: Garniture souple (tissu, papier, cuir, etc.) fixée sur un mur, un sol, un plafond ou une fenêtre.
in scheme: T69
narrower: T69-4787
narrower: T69-4794
narrower: T69-4796
narrower: T69-4798
narrower: T69-4800
narrower: T69-4803
narrower: T69-4805
related: T69-4887
related: T69-6707