encadrement de fenêtre
created: 2012-05-16T00:00:00+02:00
modified: 2014-12-12T11:07:04+01:00
status: 1
type: Concept
alternative label: bandeau de fenêtre
alternative label: cantonnière
alternative label: embrase
alternative label: lambrequin textile
broad match: Garniture
broader: T69-4785
definition: Décor de tissu encadrant une baie, assorti ou non aux rideaux, constitué d'un lambrequin ou d'un bandeau, de cantonnières, éventuellement d'embrases.
in scheme: T69
narrow match: cb12003001h
preferred label: coverings and hangings for openings @en-us