pièce murale
created: 2012-05-16T00:00:00+02:00
modified: 2014-12-12T11:17:56+01:00
status: 1
type: Concept
alternative label: tapisserie
broader: T69-4803
definition: Ouvrage, généralement de tapisserie, constituant une œuvre en elle-même, mais pouvant également appartenir à un ensemble conçu et exécuté pour former une œuvre unique, la tenture murale (de tapisserie).
in scheme: T69
narrower: T69-4792
preferred label: tapestries @en-us