entrefenêtre
created: 2012-05-16T00:00:00+02:00
modified: 2014-12-12T11:19:36+01:00
status: 1
type: Concept
broad match: http://data.bnf.fr/ark:/12148/cb119336376
broad match: Tapisserie
broader: T69-4789
definition: Pièce murale de tapisserie destinée, par ses dimensions en général étroites, à être placée entre deux fenêtres.
in scheme: T69
preferred label: entrefenêtres @en-us