portière
created: 2012-05-16T00:00:00+02:00
modified: 2014-12-12T11:07:53+01:00
status: 1
type: Concept
broad match: http://data.bnf.fr/ark:/12148/cb131628658
broader: T69-4785
definition: Pièce de tapisserie ou de tissu masquant une porte.
in scheme: T69
preferred label: portieres @en-us