rideau de fenêtre
created: 2012-05-16T00:00:00+02:00
modified: 2014-12-12T11:09:26+01:00
status: 1
type: Concept
alternative label: double-rideau
alternative label: store
alternative label: voilage
broader: T69-4785
definition: Pièce de tissu, voilage ou tissu épais, suspendue devant une baie, et destinée à filtrer ou à masquer la lumière.
in scheme: T69
preferred label: curtains (window hangings) @en-us