rideau de scène
created: 2012-05-16T00:00:00+02:00
modified: 2014-12-12T11:11:28+01:00
status: 1
type: Concept
alternative label: rideau d'avant-scène
broader: T69-4785
definition: Grande draperie ou toile peinte placée entre la salle et la scène et destinée, outre son rôle décoratif, à dissimuler cette dernière quand elle n'est pas occupée par le déroulement d'une représentation.
in scheme: T69
preferred label: stage curtains @en-us