tapis de sol
created: 2012-05-16T00:00:00+02:00
modified: 2014-12-12T11:12:43+01:00
status: 1
type: Concept
broader: T69-4785
definition: Ouvrage le plus souvent textile (tissé, noué ou brodé) destiné à recouvrir le sol pour l'orner ou l'isoler.
in scheme: T69
preferred label: rugs (textiles) @en-us