tenture murale
created: 2012-05-16T00:00:00+02:00
modified: 2014-12-12T11:13:47+01:00
status: 1
type: Concept
broader: T69-4785
definition: Ensemble de pièces murales, généralement de tapisserie, illustrant différents aspects d'un thème ou les épisodes d'un cycle, et souvent tissées par le même atelier. Ces ensembles servent à parer ou à cacher les murs et sont destinés à être transportés de demeure en demeure.
in scheme: T69
narrower: T69-4789
preferred label: wall hangings @en-us